Кремень FMZ Реклама
Kremen FMHM Реклама

Помогите пожалуйста с прошивкой на плату Creality 4.2.7 под Ender 5 Plus

666AUTOBOT666
Идет загрузка
Загрузка
28.01.2023
1201
7
Вопросы и ответы
Статья относится к принтерам:
Ender-5 Plus

Приветствую. 

Требуется помощь с прошивкой под плату Creality 4.2.7 под Ender 5 Plus

Так как я новичок в мире принтеров,не получается подогнать под принтер.

Скачал Marlin 2.1.2, вкинул файлы конфигурации под свой принтер, вписал через Visual Studio Code новую плату,  драйвера и микроконтроллер. Дальше куда копать не пойму. При компиляции выдаёт ошибки .

Прошу помощи у знатоков.

Вот что мне выдаёт:

Processing STM32F103RE_creality (board: genericSTM32F103RE; platform: ststm32@~12.1; framework: arduino)

--------------------------------------------------------------------------------------------------------------------------------------------------------------------------Verbose mode can be enabled via `-v, --verbose` option

CONFIGURATION: https://docs.platformio.org/page/boards/ststm32/genericSTM32F103RE.html

PLATFORM: ST STM32 (12.1.1) > STM32F103RE (64k RAM. 512k Flash)

HARDWARE: STM32F103RET6 72MHz, 64KB RAM, 512KB Flash

DEBUG: Current (jlink) External (blackmagic, cmsis-dap, jlink, stlink)

PACKAGES:

 - framework-arduinoststm32 @ 4.10900.200819 (1.9.0)

 - framework-cmsis @ 2.50501.200527 (5.5.1)

 - toolchain-gccarmnoneeabi @ 1.90201.191206 (9.2.1)

Converting Marlin.ino

LDF: Library Dependency Finder -> https://bit.ly/configure-pio-ldf

LDF Modes: Finder ~ chain, Compatibility ~ soft

Found 10 compatible libraries

Scanning dependencies...

Dependency Graph

|-- IWatchdog @ 1.0.0

|-- SPI @ 1.0

|-- EEPROM @ 2.0.1

|-- SoftwareSerial @ 1.0

|-- Wire @ 1.0

|-- Servo @ 1.1.2

Building in release mode

Compiling .pio\build\STM32F103RE_creality\FrameworkArduinoVariant\PeripheralPins.c.o

Compiling .pio\build\STM32F103RE_creality\FrameworkArduinoVariant\variant.cpp.o

Compiling .pio\build\STM32F103RE_creality\FrameworkArduino\HardwareSerial.cpp.o

Compiling .pio\build\STM32F103RE_creality\FrameworkArduino\HardwareTimer.cpp.o

Compiling .pio\build\STM32F103RE_creality\FrameworkArduino\IPAddress.cpp.o

Compiling .pio\build\STM32F103RE_creality\FrameworkArduino\Print.cpp.o

Compiling .pio\build\STM32F103RE_creality\FrameworkArduino\RingBuffer.cpp.o

Compiling .pio\build\STM32F103RE_creality\FrameworkArduino\Stream.cpp.o

Compiling .pio\build\STM32F103RE_creality\FrameworkArduino\Tone.cpp.o

Compiling .pio\build\STM32F103RE_creality\FrameworkArduino\USBSerial.cpp.o

Compiling .pio\build\STM32F103RE_creality\FrameworkArduino\VirtIOSerial.cpp.o

Compiling .pio\build\STM32F103RE_creality\FrameworkArduino\WInterrupts.cpp.o

Compiling .pio\build\STM32F103RE_creality\FrameworkArduino\WMath.cpp.o

Compiling .pio\build\STM32F103RE_creality\FrameworkArduino\WSerial.cpp.o

Compiling .pio\build\STM32F103RE_creality\FrameworkArduino\WString.cpp.o

Compiling .pio\build\STM32F103RE_creality\FrameworkArduino\abi.cpp.o

Compiling .pio\build\STM32F103RE_creality\FrameworkArduino\avr\dtostrf.c.o

Compiling .pio\build\STM32F103RE_creality\FrameworkArduino\board.c.o

Compiling .pio\build\STM32F103RE_creality\FrameworkArduino\hooks.c.o

Compiling .pio\build\STM32F103RE_creality\FrameworkArduino\itoa.c.o

Compiling .pio\build\STM32F103RE_creality\FrameworkArduino\main.cpp.o

Compiling .pio\build\STM32F103RE_creality\FrameworkArduino\new.cpp.o

Compiling .pio\build\STM32F103RE_creality\FrameworkArduino\pins_arduino.c.o

Compiling .pio\build\STM32F103RE_creality\FrameworkArduino\stm32\OpenAMP\libmetal\device.c.o

Compiling .pio\build\STM32F103RE_creality\FrameworkArduino\stm32\OpenAMP\libmetal\generic\condition.c.o

Compiling .pio\build\STM32F103RE_creality\FrameworkArduino\stm32\OpenAMP\libmetal\generic\cortexm\sys.c.o

Compiling .pio\build\STM32F103RE_creality\FrameworkArduino\stm32\OpenAMP\libmetal\generic\generic_device.c.o

Compiling .pio\build\STM32F103RE_creality\FrameworkArduino\stm32\OpenAMP\libmetal\generic\generic_init.c.o

Compiling .pio\build\STM32F103RE_creality\FrameworkArduino\stm32\OpenAMP\libmetal\generic\generic_io.c.o

Compiling .pio\build\STM32F103RE_creality\FrameworkArduino\stm32\OpenAMP\libmetal\generic\generic_shmem.c.o

Compiling .pio\build\STM32F103RE_creality\FrameworkArduino\stm32\OpenAMP\libmetal\generic\time.c.o

Compiling .pio\build\STM32F103RE_creality\FrameworkArduino\stm32\OpenAMP\libmetal\init.c.o

Compiling .pio\build\STM32F103RE_creality\FrameworkArduino\stm32\OpenAMP\libmetal\io.c.o

Compiling .pio\build\STM32F103RE_creality\FrameworkArduino\stm32\OpenAMP\libmetal\log.c.o

Compiling .pio\build\STM32F103RE_creality\FrameworkArduino\stm32\OpenAMP\libmetal\shmem.c.o

Compiling .pio\build\STM32F103RE_creality\FrameworkArduino\stm32\OpenAMP\mbox_ipcc.c.o

Compiling .pio\build\STM32F103RE_creality\FrameworkArduino\stm32\OpenAMP\open-amp\remoteproc\remoteproc_virtio.c.o

Compiling .pio\build\STM32F103RE_creality\FrameworkArduino\stm32\OpenAMP\open-amp\rpmsg\rpmsg.c.o

Compiling .pio\build\STM32F103RE_creality\FrameworkArduino\stm32\OpenAMP\open-amp\rpmsg\rpmsg_virtio.c.o

Compiling .pio\build\STM32F103RE_creality\FrameworkArduino\stm32\OpenAMP\openamp.c.o

Compiling .pio\build\STM32F103RE_creality\FrameworkArduino\stm32\OpenAMP\rsc_table.c.o

Compiling .pio\build\STM32F103RE_creality\FrameworkArduino\stm32\OpenAMP\virt_uart.c.o

Compiling .pio\build\STM32F103RE_creality\FrameworkArduino\stm32\OpenAMP\virtio\virtio.c.o

Compiling .pio\build\STM32F103RE_creality\FrameworkArduino\stm32\OpenAMP\virtio\virtqueue.c.o

Compiling .pio\build\STM32F103RE_creality\FrameworkArduino\stm32\OpenAMP\virtio_buffer.c.o

Compiling .pio\build\STM32F103RE_creality\FrameworkArduino\stm32\OpenAMP\virtio_log.c.o

Compiling .pio\build\STM32F103RE_creality\FrameworkArduino\stm32\startup_stm32yyxx.S.o

Compiling .pio\build\STM32F103RE_creality\FrameworkArduino\stm32\usb\cdc\cdc_queue.c.o

Compiling .pio\build\STM32F103RE_creality\FrameworkArduino\stm32\usb\cdc\usbd_cdc.c.o

Compiling .pio\build\STM32F103RE_creality\FrameworkArduino\stm32\usb\cdc\usbd_cdc_if.c.o

Compiling .pio\build\STM32F103RE_creality\FrameworkArduino\stm32\usb\hid\usbd_hid_composite.c.o

Compiling .pio\build\STM32F103RE_creality\FrameworkArduino\stm32\usb\hid\usbd_hid_composite_if.c.o

Compiling .pio\build\STM32F103RE_creality\FrameworkArduino\stm32\usb\usb_device_core.c.o

Compiling .pio\build\STM32F103RE_creality\FrameworkArduino\stm32\usb\usb_device_ctlreq.c.o

Compiling .pio\build\STM32F103RE_creality\FrameworkArduino\stm32\usb\usb_device_ioreq.c.o

Compiling .pio\build\STM32F103RE_creality\FrameworkArduino\stm32\usb\usbd_conf.c.o

Compiling .pio\build\STM32F103RE_creality\FrameworkArduino\stm32\usb\usbd_desc.c.o

Compiling .pio\build\STM32F103RE_creality\FrameworkArduino\stm32\usb\usbd_ep_conf.c.o

Compiling .pio\build\STM32F103RE_creality\FrameworkArduino\stm32\usb\usbd_if.c.o

Compiling .pio\build\STM32F103RE_creality\FrameworkArduino\wiring_analog.c.o

Compiling .pio\build\STM32F103RE_creality\FrameworkArduino\wiring_digital.c.o

Compiling .pio\build\STM32F103RE_creality\FrameworkArduino\wiring_pulse.cpp.o

Compiling .pio\build\STM32F103RE_creality\FrameworkArduino\wiring_shift.c.o

Compiling .pio\build\STM32F103RE_creality\FrameworkArduino\wiring_time.c.o

Compiling .pio\build\STM32F103RE_creality\SrcWrapper\src\HAL\stm32yyxx_hal.c.o

Compiling .pio\build\STM32F103RE_creality\SrcWrapper\src\HAL\stm32yyxx_hal_adc.c.o

Compiling .pio\build\STM32F103RE_creality\SrcWrapper\src\HAL\stm32yyxx_hal_adc_ex.c.o

Compiling .pio\build\STM32F103RE_creality\SrcWrapper\src\HAL\stm32yyxx_hal_can.c.o

Compiling .pio\build\STM32F103RE_creality\SrcWrapper\src\HAL\stm32yyxx_hal_cec.c.o

Compiling .pio\build\STM32F103RE_creality\SrcWrapper\src\HAL\stm32yyxx_hal_comp.c.o

Compiling .pio\build\STM32F103RE_creality\SrcWrapper\src\HAL\stm32yyxx_hal_comp_ex.c.o

Compiling .pio\build\STM32F103RE_creality\SrcWrapper\src\HAL\stm32yyxx_hal_cordic.c.o

Compiling .pio\build\STM32F103RE_creality\SrcWrapper\src\HAL\stm32yyxx_hal_cortex.c.o

Compiling .pio\build\STM32F103RE_creality\SrcWrapper\src\HAL\stm32yyxx_hal_crc.c.o

Compiling .pio\build\STM32F103RE_creality\SrcWrapper\src\HAL\stm32yyxx_hal_crc_ex.c.o

Compiling .pio\build\STM32F103RE_creality\SrcWrapper\src\HAL\stm32yyxx_hal_cryp.c.o

Compiling .pio\build\STM32F103RE_creality\SrcWrapper\src\HAL\stm32yyxx_hal_cryp_ex.c.o

Compiling .pio\build\STM32F103RE_creality\SrcWrapper\src\HAL\stm32yyxx_hal_dac.c.o

Compiling .pio\build\STM32F103RE_creality\SrcWrapper\src\HAL\stm32yyxx_hal_dac_ex.c.o

Compiling .pio\build\STM32F103RE_creality\SrcWrapper\src\HAL\stm32yyxx_hal_dcmi.c.o

Compiling .pio\build\STM32F103RE_creality\SrcWrapper\src\HAL\stm32yyxx_hal_dcmi_ex.c.o

Compiling .pio\build\STM32F103RE_creality\SrcWrapper\src\HAL\stm32yyxx_hal_dfsdm.c.o

Compiling .pio\build\STM32F103RE_creality\SrcWrapper\src\HAL\stm32yyxx_hal_dfsdm_ex.c.o

Compiling .pio\build\STM32F103RE_creality\SrcWrapper\src\HAL\stm32yyxx_hal_dma.c.o

Compiling .pio\build\STM32F103RE_creality\SrcWrapper\src\HAL\stm32yyxx_hal_dma2d.c.o

Compiling .pio\build\STM32F103RE_creality\SrcWrapper\src\HAL\stm32yyxx_hal_dma_ex.c.o

Compiling .pio\build\STM32F103RE_creality\SrcWrapper\src\HAL\stm32yyxx_hal_dsi.c.o

Compiling .pio\build\STM32F103RE_creality\SrcWrapper\src\HAL\stm32yyxx_hal_dts.c.o

Compiling .pio\build\STM32F103RE_creality\SrcWrapper\src\HAL\stm32yyxx_hal_eth.c.o

Compiling .pio\build\STM32F103RE_creality\SrcWrapper\src\HAL\stm32yyxx_hal_eth_ex.c.o

Compiling .pio\build\STM32F103RE_creality\SrcWrapper\src\HAL\stm32yyxx_hal_exti.c.o

Compiling .pio\build\STM32F103RE_creality\SrcWrapper\src\HAL\stm32yyxx_hal_fdcan.c.o

Compiling .pio\build\STM32F103RE_creality\SrcWrapper\src\HAL\stm32yyxx_hal_firewall.c.o

Compiling .pio\build\STM32F103RE_creality\SrcWrapper\src\HAL\stm32yyxx_hal_flash.c.o

Compiling .pio\build\STM32F103RE_creality\SrcWrapper\src\HAL\stm32yyxx_hal_flash_ex.c.o

Compiling .pio\build\STM32F103RE_creality\SrcWrapper\src\HAL\stm32yyxx_hal_flash_ramfunc.c.o

Compiling .pio\build\STM32F103RE_creality\SrcWrapper\src\HAL\stm32yyxx_hal_fmac.c.o

Compiling .pio\build\STM32F103RE_creality\SrcWrapper\src\HAL\stm32yyxx_hal_fmpi2c.c.o

Compiling .pio\build\STM32F103RE_creality\SrcWrapper\src\HAL\stm32yyxx_hal_fmpi2c_ex.c.o

Compiling .pio\build\STM32F103RE_creality\SrcWrapper\src\HAL\stm32yyxx_hal_gfxmmu.c.o

Compiling .pio\build\STM32F103RE_creality\SrcWrapper\src\HAL\stm32yyxx_hal_gpio.c.o

Compiling .pio\build\STM32F103RE_creality\SrcWrapper\src\HAL\stm32yyxx_hal_gpio_ex.c.o

Compiling .pio\build\STM32F103RE_creality\SrcWrapper\src\HAL\stm32yyxx_hal_hash.c.o

Compiling .pio\build\STM32F103RE_creality\SrcWrapper\src\HAL\stm32yyxx_hal_hash_ex.c.o

Compiling .pio\build\STM32F103RE_creality\SrcWrapper\src\HAL\stm32yyxx_hal_hcd.c.o

Compiling .pio\build\STM32F103RE_creality\SrcWrapper\src\HAL\stm32yyxx_hal_hrtim.c.o

Compiling .pio\build\STM32F103RE_creality\SrcWrapper\src\HAL\stm32yyxx_hal_hsem.c.o

Compiling .pio\build\STM32F103RE_creality\SrcWrapper\src\HAL\stm32yyxx_hal_i2c.c.o

Compiling .pio\build\STM32F103RE_creality\SrcWrapper\src\HAL\stm32yyxx_hal_i2c_ex.c.o

Compiling .pio\build\STM32F103RE_creality\SrcWrapper\src\HAL\stm32yyxx_hal_i2s.c.o

Compiling .pio\build\STM32F103RE_creality\SrcWrapper\src\HAL\stm32yyxx_hal_i2s_ex.c.o

Compiling .pio\build\STM32F103RE_creality\SrcWrapper\src\HAL\stm32yyxx_hal_ipcc.c.o

Compiling .pio\build\STM32F103RE_creality\SrcWrapper\src\HAL\stm32yyxx_hal_irda.c.o

Compiling .pio\build\STM32F103RE_creality\SrcWrapper\src\HAL\stm32yyxx_hal_iwdg.c.o

Compiling .pio\build\STM32F103RE_creality\SrcWrapper\src\HAL\stm32yyxx_hal_jpeg.c.o

Compiling .pio\build\STM32F103RE_creality\SrcWrapper\src\HAL\stm32yyxx_hal_lcd.c.o

Compiling .pio\build\STM32F103RE_creality\SrcWrapper\src\HAL\stm32yyxx_hal_lptim.c.o

Compiling .pio\build\STM32F103RE_creality\SrcWrapper\src\HAL\stm32yyxx_hal_ltdc.c.o

Compiling .pio\build\STM32F103RE_creality\SrcWrapper\src\HAL\stm32yyxx_hal_ltdc_ex.c.o

Compiling .pio\build\STM32F103RE_creality\SrcWrapper\src\HAL\stm32yyxx_hal_mdios.c.o

Compiling .pio\build\STM32F103RE_creality\SrcWrapper\src\HAL\stm32yyxx_hal_mdma.c.o

Compiling .pio\build\STM32F103RE_creality\SrcWrapper\src\HAL\stm32yyxx_hal_mmc.c.o

Compiling .pio\build\STM32F103RE_creality\SrcWrapper\src\HAL\stm32yyxx_hal_mmc_ex.c.o

Compiling .pio\build\STM32F103RE_creality\SrcWrapper\src\HAL\stm32yyxx_hal_nand.c.o

Compiling .pio\build\STM32F103RE_creality\SrcWrapper\src\HAL\stm32yyxx_hal_nor.c.o

Compiling .pio\build\STM32F103RE_creality\SrcWrapper\src\HAL\stm32yyxx_hal_opamp.c.o

Compiling .pio\build\STM32F103RE_creality\SrcWrapper\src\HAL\stm32yyxx_hal_opamp_ex.c.o

Compiling .pio\build\STM32F103RE_creality\SrcWrapper\src\HAL\stm32yyxx_hal_ospi.c.o

Compiling .pio\build\STM32F103RE_creality\SrcWrapper\src\HAL\stm32yyxx_hal_otfdec.c.o

Compiling .pio\build\STM32F103RE_creality\SrcWrapper\src\HAL\stm32yyxx_hal_pccard.c.o

Compiling .pio\build\STM32F103RE_creality\SrcWrapper\src\HAL\stm32yyxx_hal_pcd.c.o

Compiling .pio\build\STM32F103RE_creality\SrcWrapper\src\HAL\stm32yyxx_hal_pcd_ex.c.o

Compiling .pio\build\STM32F103RE_creality\SrcWrapper\src\HAL\stm32yyxx_hal_pka.c.o

Compiling .pio\build\STM32F103RE_creality\SrcWrapper\src\HAL\stm32yyxx_hal_pssi.c.o

Compiling .pio\build\STM32F103RE_creality\SrcWrapper\src\HAL\stm32yyxx_hal_pwr.c.o

Compiling .pio\build\STM32F103RE_creality\SrcWrapper\src\HAL\stm32yyxx_hal_pwr_ex.c.o

Compiling .pio\build\STM32F103RE_creality\SrcWrapper\src\HAL\stm32yyxx_hal_qspi.c.o

Compiling .pio\build\STM32F103RE_creality\SrcWrapper\src\HAL\stm32yyxx_hal_ramecc.c.o

Compiling .pio\build\STM32F103RE_creality\SrcWrapper\src\HAL\stm32yyxx_hal_rcc.c.o

Compiling .pio\build\STM32F103RE_creality\SrcWrapper\src\HAL\stm32yyxx_hal_rcc_ex.c.o

Compiling .pio\build\STM32F103RE_creality\SrcWrapper\src\HAL\stm32yyxx_hal_rng.c.o

Compiling .pio\build\STM32F103RE_creality\SrcWrapper\src\HAL\stm32yyxx_hal_rng_ex.c.o

Compiling .pio\build\STM32F103RE_creality\SrcWrapper\src\HAL\stm32yyxx_hal_rtc.c.o

Compiling .pio\build\STM32F103RE_creality\SrcWrapper\src\HAL\stm32yyxx_hal_rtc_ex.c.o

Compiling .pio\build\STM32F103RE_creality\SrcWrapper\src\HAL\stm32yyxx_hal_sai.c.o

Compiling .pio\build\STM32F103RE_creality\SrcWrapper\src\HAL\stm32yyxx_hal_sai_ex.c.o

Compiling .pio\build\STM32F103RE_creality\SrcWrapper\src\HAL\stm32yyxx_hal_sd.c.o

Compiling .pio\build\STM32F103RE_creality\SrcWrapper\src\HAL\stm32yyxx_hal_sd_ex.c.o

Compiling .pio\build\STM32F103RE_creality\SrcWrapper\src\HAL\stm32yyxx_hal_sdadc.c.o

Compiling .pio\build\STM32F103RE_creality\SrcWrapper\src\HAL\stm32yyxx_hal_sdram.c.o

Compiling .pio\build\STM32F103RE_creality\SrcWrapper\src\HAL\stm32yyxx_hal_smartcard.c.o

Compiling .pio\build\STM32F103RE_creality\SrcWrapper\src\HAL\stm32yyxx_hal_smartcard_ex.c.o

Compiling .pio\build\STM32F103RE_creality\SrcWrapper\src\HAL\stm32yyxx_hal_smbus.c.o

Compiling .pio\build\STM32F103RE_creality\SrcWrapper\src\HAL\stm32yyxx_hal_spdifrx.c.o

Compiling .pio\build\STM32F103RE_creality\SrcWrapper\src\HAL\stm32yyxx_hal_spi.c.o

Compiling .pio\build\STM32F103RE_creality\SrcWrapper\src\HAL\stm32yyxx_hal_spi_ex.c.o

Compiling .pio\build\STM32F103RE_creality\SrcWrapper\src\HAL\stm32yyxx_hal_sram.c.o

Compiling .pio\build\STM32F103RE_creality\SrcWrapper\src\HAL\stm32yyxx_hal_swpmi.c.o

Compiling .pio\build\STM32F103RE_creality\SrcWrapper\src\HAL\stm32yyxx_hal_tim.c.o

Compiling .pio\build\STM32F103RE_creality\SrcWrapper\src\HAL\stm32yyxx_hal_tim_ex.c.o

Compiling .pio\build\STM32F103RE_creality\SrcWrapper\src\HAL\stm32yyxx_hal_tsc.c.o

Compiling .pio\build\STM32F103RE_creality\SrcWrapper\src\HAL\stm32yyxx_hal_uart.c.o

Compiling .pio\build\STM32F103RE_creality\SrcWrapper\src\HAL\stm32yyxx_hal_uart_ex.c.o

Compiling .pio\build\STM32F103RE_creality\SrcWrapper\src\HAL\stm32yyxx_hal_usart.c.o

Compiling .pio\build\STM32F103RE_creality\SrcWrapper\src\HAL\stm32yyxx_hal_usart_ex.c.o

Compiling .pio\build\STM32F103RE_creality\SrcWrapper\src\HAL\stm32yyxx_hal_wwdg.c.o

Compiling .pio\build\STM32F103RE_creality\SrcWrapper\src\LL\stm32yyxx_ll_adc.c.o

Compiling .pio\build\STM32F103RE_creality\SrcWrapper\src\LL\stm32yyxx_ll_bdma.c.o

Compiling .pio\build\STM32F103RE_creality\SrcWrapper\src\LL\stm32yyxx_ll_comp.c.o

Compiling .pio\build\STM32F103RE_creality\SrcWrapper\src\LL\stm32yyxx_ll_cordic.c.o

Compiling .pio\build\STM32F103RE_creality\SrcWrapper\src\LL\stm32yyxx_ll_crc.c.o

Compiling .pio\build\STM32F103RE_creality\SrcWrapper\src\LL\stm32yyxx_ll_crs.c.o

Compiling .pio\build\STM32F103RE_creality\SrcWrapper\src\LL\stm32yyxx_ll_dac.c.o

Compiling .pio\build\STM32F103RE_creality\SrcWrapper\src\LL\stm32yyxx_ll_delayblock.c.o

Compiling .pio\build\STM32F103RE_creality\SrcWrapper\src\LL\stm32yyxx_ll_dma.c.o

Compiling .pio\build\STM32F103RE_creality\SrcWrapper\src\LL\stm32yyxx_ll_dma2d.c.o

Compiling .pio\build\STM32F103RE_creality\SrcWrapper\src\LL\stm32yyxx_ll_exti.c.o

Compiling .pio\build\STM32F103RE_creality\SrcWrapper\src\LL\stm32yyxx_ll_fmac.c.o

Compiling .pio\build\STM32F103RE_creality\SrcWrapper\src\LL\stm32yyxx_ll_fmc.c.o

Compiling .pio\build\STM32F103RE_creality\SrcWrapper\src\LL\stm32yyxx_ll_fsmc.c.o

Compiling .pio\build\STM32F103RE_creality\SrcWrapper\src\LL\stm32yyxx_ll_gpio.c.o

Compiling .pio\build\STM32F103RE_creality\SrcWrapper\src\LL\stm32yyxx_ll_hrtim.c.o

Compiling .pio\build\STM32F103RE_creality\SrcWrapper\src\LL\stm32yyxx_ll_i2c.c.o

Compiling .pio\build\STM32F103RE_creality\SrcWrapper\src\LL\stm32yyxx_ll_lptim.c.o

Compiling .pio\build\STM32F103RE_creality\SrcWrapper\src\LL\stm32yyxx_ll_lpuart.c.o

Compiling .pio\build\STM32F103RE_creality\SrcWrapper\src\LL\stm32yyxx_ll_mdma.c.o

Compiling .pio\build\STM32F103RE_creality\SrcWrapper\src\LL\stm32yyxx_ll_opamp.c.o

Compiling .pio\build\STM32F103RE_creality\SrcWrapper\src\LL\stm32yyxx_ll_pka.c.o

Compiling .pio\build\STM32F103RE_creality\SrcWrapper\src\LL\stm32yyxx_ll_pwr.c.o

Compiling .pio\build\STM32F103RE_creality\SrcWrapper\src\LL\stm32yyxx_ll_rcc.c.o

Compiling .pio\build\STM32F103RE_creality\SrcWrapper\src\LL\stm32yyxx_ll_rng.c.o

Compiling .pio\build\STM32F103RE_creality\SrcWrapper\src\LL\stm32yyxx_ll_rtc.c.o

Compiling .pio\build\STM32F103RE_creality\SrcWrapper\src\LL\stm32yyxx_ll_sdmmc.c.o

Compiling .pio\build\STM32F103RE_creality\SrcWrapper\src\LL\stm32yyxx_ll_spi.c.o

Compiling .pio\build\STM32F103RE_creality\SrcWrapper\src\LL\stm32yyxx_ll_swpmi.c.o

Compiling .pio\build\STM32F103RE_creality\SrcWrapper\src\LL\stm32yyxx_ll_tim.c.o

Compiling .pio\build\STM32F103RE_creality\SrcWrapper\src\LL\stm32yyxx_ll_ucpd.c.o

Compiling .pio\build\STM32F103RE_creality\SrcWrapper\src\LL\stm32yyxx_ll_usart.c.o

Compiling .pio\build\STM32F103RE_creality\SrcWrapper\src\LL\stm32yyxx_ll_usb.c.o

Compiling .pio\build\STM32F103RE_creality\SrcWrapper\src\LL\stm32yyxx_ll_utils.c.o

Compiling .pio\build\STM32F103RE_creality\SrcWrapper\src\stm32\PortNames.c.o

Compiling .pio\build\STM32F103RE_creality\SrcWrapper\src\stm32\analog.cpp.o

Compiling .pio\build\STM32F103RE_creality\SrcWrapper\src\stm32\bootloader.c.o

Compiling .pio\build\STM32F103RE_creality\SrcWrapper\src\stm32\clock.c.o

Compiling .pio\build\STM32F103RE_creality\SrcWrapper\src\stm32\core_callback.c.o

Compiling .pio\build\STM32F103RE_creality\SrcWrapper\src\stm32\dwt.c.o

Compiling .pio\build\STM32F103RE_creality\SrcWrapper\src\stm32\hw_config.c.o

Compiling .pio\build\STM32F103RE_creality\SrcWrapper\src\stm32\interrupt.cpp.o

Compiling .pio\build\STM32F103RE_creality\SrcWrapper\src\stm32\lock_resource.c.o

Compiling .pio\build\STM32F103RE_creality\SrcWrapper\src\stm32\low_power.c.o

Compiling .pio\build\STM32F103RE_creality\SrcWrapper\src\stm32\pinmap.c.o

Compiling .pio\build\STM32F103RE_creality\SrcWrapper\src\stm32\rtc.c.o

Compiling .pio\build\STM32F103RE_creality\SrcWrapper\src\stm32\stm32_def.c.o

Compiling .pio\build\STM32F103RE_creality\SrcWrapper\src\stm32\stm32_eeprom.c.o

Compiling .pio\build\STM32F103RE_creality\SrcWrapper\src\stm32\system_stm32yyxx.c.o

Compiling .pio\build\STM32F103RE_creality\SrcWrapper\src\stm32\timer.c.o

Compiling .pio\build\STM32F103RE_creality\SrcWrapper\src\stm32\uart.c.o

Compiling .pio\build\STM32F103RE_creality\SrcWrapper\src\syscalls.c.o

Compiling .pio\build\STM32F103RE_creality\src\src\HAL\STM32\HAL.cpp.o

Compiling .pio\build\STM32F103RE_creality\src\src\HAL\STM32\HAL_SPI.cpp.o

Compiling .pio\build\STM32F103RE_creality\src\src\HAL\STM32\MarlinSPI.cpp.o

Compiling .pio\build\STM32F103RE_creality\src\src\HAL\STM32\MarlinSerial.cpp.o

Compiling .pio\build\STM32F103RE_creality\src\src\HAL\STM32\MinSerial.cpp.o

Compiling .pio\build\STM32F103RE_creality\src\src\HAL\STM32\Servo.cpp.o

Compiling .pio\build\STM32F103RE_creality\src\src\HAL\STM32\eeprom_bl24cxx.cpp.o

Compiling .pio\build\STM32F103RE_creality\src\src\HAL\STM32\eeprom_flash.cpp.o

Помогите пожалуйста с прошивкой на плату Creality 4.2.7 под Ender 5 PlusIn file included from Marlin\src\HAL\STM32\../../inc/../HAL/HAL.h:30,

                 from Marlin\src\HAL\STM32\../../inc/MarlinConfig.h:31,

                 from Marlin\src\HAL\STM32\HAL.cpp:27:

Compiling .pio\build\STM32F103RE_creality\src\src\HAL\STM32\eeprom_if_iic.cpp.o

Marlin\src\HAL\STM32\../../inc/../HAL/./STM32/HAL.h:62:4: error: #error "SERIAL_PORT must be from 1 to 6."

   62 | #error "SERIAL_PORT must be from 1 to 6."

      | ^~~~~

In file included from Marlin\src\HAL\STM32\../../inc/../pins/pins.h:926,

                 from Marlin\src\HAL\STM32\../../inc/MarlinConfig.h:34,

                 from Marlin\src\HAL\STM32\HAL.cpp:27:

Marlin\src\HAL\STM32\../../inc/../pins/pins_postprocess.h:500: warning: "X_MAX_PIN" redefined

  500 | #define X_MAX_PIN X_STOP_PIN

      |

In file included from Marlin\src\HAL\STM32\../../inc/MarlinConfigPre.h:39,

                 from Marlin\src\HAL\STM32\../../inc/MarlinConfig.h:28,

                 from Marlin\src\HAL\STM32\HAL.cpp:27:

Marlin\src\HAL\STM32\../../inc/../../Configuration.h:95: note: this is the location of the previous definition

   95 | #define X_MAX_PIN 3 // Creality connects X_MAX to X_MIN(_PIN) motherboard connector

      |

In file included from Marlin\src\HAL\STM32\../../inc/../pins/pins.h:926,

                 from Marlin\src\HAL\STM32\../../inc/MarlinConfig.h:34,

                 from Marlin\src\HAL\STM32\HAL.cpp:27:

Marlin\src\HAL\STM32\../../inc/../pins/pins_postprocess.h:522: warning: "Y_MAX_PIN" redefined

  522 | #define Y_MAX_PIN Y_STOP_PIN

      |

In file included from Marlin\src\HAL\STM32\../../inc/MarlinConfigPre.h:39,

                 from Marlin\src\HAL\STM32\../../inc/MarlinConfig.h:28,

                 from Marlin\src\HAL\STM32\HAL.cpp:27:

Marlin\src\HAL\STM32\../../inc/../../Configuration.h:96: note: this is the location of the previous definition

   96 | #define Y_MAX_PIN 14 // Creality connects Y_MAX to Y_MIN(_PIN) motherboard connector

      |

In file included from Marlin\src\HAL\STM32\../../inc/../HAL/HAL.h:30,

                 from Marlin\src\HAL\STM32\../../inc/MarlinConfig.h:31,

                 from Marlin\src\HAL\STM32\HAL_SPI.cpp:27:

Marlin\src\HAL\STM32\../../inc/../HAL/./STM32/HAL.h:62:4: error: #error "SERIAL_PORT must be from 1 to 6."

   62 | #error "SERIAL_PORT must be from 1 to 6."

      | ^~~~~

In file included from Marlin\src\HAL\STM32\../../inc/../pins/pins.h:926,

                 from Marlin\src\HAL\STM32\../../inc/MarlinConfig.h:34,

                 from Marlin\src\HAL\STM32\HAL_SPI.cpp:27:

Marlin\src\HAL\STM32\../../inc/../pins/pins_postprocess.h:500: warning: "X_MAX_PIN" redefined

  500 | #define X_MAX_PIN X_STOP_PIN

      |

In file included from Marlin\src\HAL\STM32\../../inc/MarlinConfigPre.h:39,

                 from Marlin\src\HAL\STM32\../../inc/MarlinConfig.h:28,

                 from Marlin\src\HAL\STM32\HAL_SPI.cpp:27:

Marlin\src\HAL\STM32\../../inc/../../Configuration.h:95: note: this is the location of the previous definition

   95 | #define X_MAX_PIN 3 // Creality connects X_MAX to X_MIN(_PIN) motherboard connector

      |

In file included from Marlin\src\HAL\STM32\../../inc/../pins/pins.h:926,

                 from Marlin\src\HAL\STM32\../../inc/MarlinConfig.h:34,

                 from Marlin\src\HAL\STM32\HAL_SPI.cpp:27:

Marlin\src\HAL\STM32\../../inc/../pins/pins_postprocess.h:522: warning: "Y_MAX_PIN" redefined

  522 | #define Y_MAX_PIN Y_STOP_PIN

      |

In file included from Marlin\src\HAL\STM32\../../inc/MarlinConfigPre.h:39,

                 from Marlin\src\HAL\STM32\../../inc/MarlinConfig.h:28,

                 from Marlin\src\HAL\STM32\HAL_SPI.cpp:27:

Marlin\src\HAL\STM32\../../inc/../../Configuration.h:96: note: this is the location of the previous definition

   96 | #define Y_MAX_PIN 14 // Creality connects Y_MAX to Y_MIN(_PIN) motherboard connector

      |

In file included from Marlin\src\HAL\STM32\../../inc/MarlinConfig.h:49,

                 from Marlin\src\HAL\STM32\HAL.cpp:27:

Marlin\src\HAL\STM32\../../inc/SanityCheck.h:2268:6: error: #error "FAN_SOFT_PWM is required for your board. Enable it to continue."

 2268 | #error "FAN_SOFT_PWM is required for your board. Enable it to continue."

      | ^~~~~

In file included from Marlin\src\HAL\STM32\../../inc/MarlinConfig.h:49,

                 from Marlin\src\HAL\STM32\HAL_SPI.cpp:27:

Marlin\src\HAL\STM32\../../inc/SanityCheck.h:2268:6: error: #error "FAN_SOFT_PWM is required for your board. Enable it to continue."

 2268 | #error "FAN_SOFT_PWM is required for your board. Enable it to continue."

      | ^~~~~

In file included from Marlin\src\HAL\STM32\../../inc/MarlinConfig.h:50,

                 from Marlin\src\HAL\STM32\HAL.cpp:27:

Marlin\src\HAL\STM32\../../inc/../HAL/STM32/inc/SanityCheck.h:72:6: error: #error "Serial Port 2 TX IO pins conflict with another pin on the board."

   72 | #error "Serial Port 2 TX IO pins conflict with another pin on the board."

      | ^~~~~

In file included from Marlin\src\HAL\STM32\MarlinSPI.h:24,

                 from Marlin\src\HAL\STM32\MarlinSPI.cpp:27:

Marlin\src\HAL\STM32\HAL.h:62:4: error: #error "SERIAL_PORT must be from 1 to 6."

   62 | #error "SERIAL_PORT must be from 1 to 6."

      | ^~~~~

In file included from Marlin\src\HAL\STM32\../../inc/MarlinConfig.h:50,

                 from Marlin\src\HAL\STM32\HAL_SPI.cpp:27:

Marlin\src\HAL\STM32\../../inc/../HAL/STM32/inc/SanityCheck.h:72:6: error: #error "Serial Port 2 TX IO pins conflict with another pin on the board."

   72 | #error "Serial Port 2 TX IO pins conflict with another pin on the board."

      | ^~~~~

In file included from Marlin\src\HAL\STM32\../../inc/../HAL/HAL.h:30,

                 from Marlin\src\HAL\STM32\../../inc/MarlinConfig.h:31,

                 from Marlin\src\HAL\STM32\MarlinSerial.cpp:27:

Marlin\src\HAL\STM32\../../inc/../HAL/./STM32/HAL.h:62:4: error: #error "SERIAL_PORT must be from 1 to 6."

   62 | #error "SERIAL_PORT must be from 1 to 6."

      | ^~~~~

In file included from Marlin\src\HAL\STM32\../../inc/../HAL/HAL.h:30,

                 from Marlin\src\HAL\STM32\../../inc/MarlinConfig.h:31,

                 from Marlin\src\HAL\STM32\eeprom_bl24cxx.cpp:32:

Marlin\src\HAL\STM32\../../inc/../HAL/./STM32/HAL.h:62:4: error: #error "SERIAL_PORT must be from 1 to 6."

   62 | #error "SERIAL_PORT must be from 1 to 6."

      | ^~~~~

In file included from Marlin\src\HAL\STM32\../../inc/../pins/pins.h:926,

                 from Marlin\src\HAL\STM32\../../inc/MarlinConfig.h:34,

                 from Marlin\src\HAL\STM32\MarlinSerial.cpp:27:

Marlin\src\HAL\STM32\../../inc/../pins/pins_postprocess.h:500: warning: "X_MAX_PIN" redefined

  500 | #define X_MAX_PIN X_STOP_PIN

      |

In file included from Marlin\src\HAL\STM32\../../inc/MarlinConfigPre.h:39,

                 from Marlin\src\HAL\STM32\../../inc/MarlinConfig.h:28,

                 from Marlin\src\HAL\STM32\MarlinSerial.cpp:27:

Marlin\src\HAL\STM32\../../inc/../../Configuration.h:95: note: this is the location of the previous definition

   95 | #define X_MAX_PIN 3 // Creality connects X_MAX to X_MIN(_PIN) motherboard connector

      |

In file included from Marlin\src\HAL\STM32\../../inc/../pins/pins.h:926,

                 from Marlin\src\HAL\STM32\../../inc/MarlinConfig.h:34,

                 from Marlin\src\HAL\STM32\MarlinSerial.cpp:27:

Marlin\src\HAL\STM32\../../inc/../pins/pins_postprocess.h:522: warning: "Y_MAX_PIN" redefined

  522 | #define Y_MAX_PIN Y_STOP_PIN

      |

In file included from Marlin\src\HAL\STM32\../../inc/MarlinConfigPre.h:39,

                 from Marlin\src\HAL\STM32\../../inc/MarlinConfig.h:28,

                 from Marlin\src\HAL\STM32\MarlinSerial.cpp:27:

Marlin\src\HAL\STM32\../../inc/../../Configuration.h:96: note: this is the location of the previous definition

   96 | #define Y_MAX_PIN 14 // Creality connects Y_MAX to Y_MIN(_PIN) motherboard connector

      |

In file included from Marlin\src\HAL\STM32\../../inc/../pins/pins.h:926,

                 from Marlin\src\HAL\STM32\../../inc/MarlinConfig.h:34,

                 from Marlin\src\HAL\STM32\eeprom_bl24cxx.cpp:32:

Marlin\src\HAL\STM32\../../inc/../pins/pins_postprocess.h:500: warning: "X_MAX_PIN" redefined

  500 | #define X_MAX_PIN X_STOP_PIN

      |

In file included from Marlin\src\HAL\STM32\../../inc/../HAL/HAL.h:30,

                 from Marlin\src\HAL\STM32\../../inc/MarlinConfig.h:31,

                 from Marlin\src\HAL\STM32\Servo.cpp:27:

Marlin\src\HAL\STM32\../../inc/../HAL/./STM32/HAL.h:62:4: error: #error "SERIAL_PORT must be from 1 to 6."

   62 | #error "SERIAL_PORT must be from 1 to 6."

      | ^~~~~

In file included from Marlin\src\HAL\STM32\../../inc/MarlinConfigPre.h:39,

                 from Marlin\src\HAL\STM32\../../inc/MarlinConfig.h:28,

                 from Marlin\src\HAL\STM32\eeprom_bl24cxx.cpp:32:

Marlin\src\HAL\STM32\../../inc/../../Configuration.h:95: note: this is the location of the previous definition

   95 | #define X_MAX_PIN 3 // Creality connects X_MAX to X_MIN(_PIN) motherboard connector

      |

In file included from Marlin\src\HAL\STM32\../../inc/../pins/pins.h:926,

                 from Marlin\src\HAL\STM32\../../inc/MarlinConfig.h:34,

                 from Marlin\src\HAL\STM32\eeprom_bl24cxx.cpp:32:

Marlin\src\HAL\STM32\../../inc/../pins/pins_postprocess.h:522: warning: "Y_MAX_PIN" redefined

  522 | #define Y_MAX_PIN Y_STOP_PIN

      |

In file included from Marlin\src\HAL\STM32\../../inc/MarlinConfigPre.h:39,

                 from Marlin\src\HAL\STM32\../../inc/MarlinConfig.h:28,

                 from Marlin\src\HAL\STM32\eeprom_bl24cxx.cpp:32:

Marlin\src\HAL\STM32\../../inc/../../Configuration.h:96: note: this is the location of the previous definition

   96 | #define Y_MAX_PIN 14 // Creality connects Y_MAX to Y_MIN(_PIN) motherboard connector

      |

In file included from Marlin\src\HAL\STM32\../../inc/MarlinConfig.h:49,

                 from Marlin\src\HAL\STM32\MarlinSerial.cpp:27:

Marlin\src\HAL\STM32\../../inc/SanityCheck.h:2268:6: error: #error "FAN_SOFT_PWM is required for your board. Enable it to continue."

 2268 | #error "FAN_SOFT_PWM is required for your board. Enable it to continue."

      | ^~~~~

In file included from Marlin\src\HAL\STM32\../../inc/../HAL/HAL.h:30,

                 from Marlin\src\HAL\STM32\../../inc/MarlinConfig.h:31,

                 from Marlin\src\HAL\STM32\eeprom_flash.cpp:27:

Marlin\src\HAL\STM32\../../inc/../HAL/./STM32/HAL.h:62:4: error: #error "SERIAL_PORT must be from 1 to 6."

   62 | #error "SERIAL_PORT must be from 1 to 6."

      | ^~~~~

In file included from Marlin\src\HAL\STM32\../../inc/../pins/pins.h:926,

                 from Marlin\src\HAL\STM32\../../inc/MarlinConfig.h:34,

                 from Marlin\src\HAL\STM32\Servo.cpp:27:

Marlin\src\HAL\STM32\../../inc/../pins/pins_postprocess.h:500: warning: "X_MAX_PIN" redefined

  500 | #define X_MAX_PIN X_STOP_PIN

      |

In file included from Marlin\src\HAL\STM32\../../inc/MarlinConfigPre.h:39,

                 from Marlin\src\HAL\STM32\../../inc/MarlinConfig.h:28,

                 from Marlin\src\HAL\STM32\Servo.cpp:27:

Marlin\src\HAL\STM32\../../inc/../../Configuration.h:95: note: this is the location of the previous definition

   95 | #define X_MAX_PIN 3 // Creality connects X_MAX to X_MIN(_PIN) motherboard connector

      |

In file included from Marlin\src\HAL\STM32\../../inc/../pins/pins.h:926,

                 from Marlin\src\HAL\STM32\../../inc/MarlinConfig.h:34,

                 from Marlin\src\HAL\STM32\Servo.cpp:27:

Marlin\src\HAL\STM32\../../inc/../pins/pins_postprocess.h:522: warning: "Y_MAX_PIN" redefined

  522 | #define Y_MAX_PIN Y_STOP_PIN

      |

In file included from Marlin\src\HAL\STM32\../../inc/MarlinConfigPre.h:39,

                 from Marlin\src\HAL\STM32\../../inc/MarlinConfig.h:28,

                 from Marlin\src\HAL\STM32\Servo.cpp:27:

Marlin\src\HAL\STM32\../../inc/../../Configuration.h:96: note: this is the location of the previous definition

   96 | #define Y_MAX_PIN 14 // Creality connects Y_MAX to Y_MIN(_PIN) motherboard connector

      |

In file included from Marlin\src\HAL\STM32\../../inc/../pins/pins.h:926,

                 from Marlin\src\HAL\STM32\../../inc/MarlinConfig.h:34,

                 from Marlin\src\HAL\STM32\eeprom_flash.cpp:27:

Marlin\src\HAL\STM32\../../inc/../pins/pins_postprocess.h:500: warning: "X_MAX_PIN" redefined

  500 | #define X_MAX_PIN X_STOP_PIN

      |

In file included from Marlin\src\HAL\STM32\../../inc/MarlinConfig.h:50,

                 from Marlin\src\HAL\STM32\MarlinSerial.cpp:27:

Marlin\src\HAL\STM32\../../inc/../HAL/STM32/inc/SanityCheck.h:72:6: error: #error "Serial Port 2 TX IO pins conflict with another pin on the board."

   72 | #error "Serial Port 2 TX IO pins conflict with another pin on the board."

      | ^~~~~

In file included from Marlin\src\HAL\STM32\../../inc/MarlinConfig.h:49,

                 from Marlin\src\HAL\STM32\eeprom_bl24cxx.cpp:32:

Marlin\src\HAL\STM32\../../inc/SanityCheck.h:2268:6: error: #error "FAN_SOFT_PWM is required for your board. Enable it to continue."

 2268 | #error "FAN_SOFT_PWM is required for your board. Enable it to continue."

      | ^~~~~

In file included from Marlin\src\HAL\STM32\../../inc/MarlinConfigPre.h:39,

                 from Marlin\src\HAL\STM32\../../inc/MarlinConfig.h:28,

                 from Marlin\src\HAL\STM32\eeprom_flash.cpp:27:

Marlin\src\HAL\STM32\../../inc/../../Configuration.h:95: note: this is the location of the previous definition

   95 | #define X_MAX_PIN 3 // Creality connects X_MAX to X_MIN(_PIN) motherboard connector

      |

In file included from Marlin\src\HAL\STM32\../../inc/../pins/pins.h:926,

                 from Marlin\src\HAL\STM32\../../inc/MarlinConfig.h:34,

                 from Marlin\src\HAL\STM32\eeprom_flash.cpp:27:

Marlin\src\HAL\STM32\../../inc/../pins/pins_postprocess.h:522: warning: "Y_MAX_PIN" redefined

  522 | #define Y_MAX_PIN Y_STOP_PIN

      |

In file included from Marlin\src\HAL\STM32\../../inc/MarlinConfigPre.h:39,

                 from Marlin\src\HAL\STM32\../../inc/MarlinConfig.h:28,

                 from Marlin\src\HAL\STM32\eeprom_flash.cpp:27:

Marlin\src\HAL\STM32\../../inc/../../Configuration.h:96: note: this is the location of the previous definition

   96 | #define Y_MAX_PIN 14 // Creality connects Y_MAX to Y_MIN(_PIN) motherboard connector

      |

In file included from Marlin\src\HAL\STM32\../../inc/MarlinConfig.h:49,

                 from Marlin\src\HAL\STM32\Servo.cpp:27:

Marlin\src\HAL\STM32\../../inc/SanityCheck.h:2268:6: error: #error "FAN_SOFT_PWM is required for your board. Enable it to continue."

 2268 | #error "FAN_SOFT_PWM is required for your board. Enable it to continue."

      | ^~~~~

In file included from Marlin\src\HAL\STM32\../../inc/MarlinConfig.h:55,

                 from Marlin\src\HAL\STM32\HAL.cpp:27:

Marlin\src\HAL\STM32\../../inc/../core/serial.h: In function 'void SERIAL_CHAR(char)':

Marlin\src\HAL\STM32\../../inc/../core/serial.h:61:26: error: 'MYSERIAL1' was not declared in this scope; did you mean 'MSERIAL'?

   61 | #define _SERIAL_LEAF_1 MYSERIAL1

      | ^~~~~~~~~

Marlin\src\HAL\STM32\../../inc/../core/serial.h:70:25: note: in expansion of macro '_SERIAL_LEAF_1'

   70 | #define SERIAL_LEAF_1 _SERIAL_LEAF_1

      | ^~~~~~~~~~~~~~

Marlin\src\HAL\STM32\../../inc/../core/serial.h:125:31: note: in expansion of macro 'SERIAL_LEAF_1'

  125 | #define SERIAL_IMPL SERIAL_LEAF_1

      | ^~~~~~~~~~~~~

Marlin\src\HAL\STM32\../../inc/../core/serial.h:137:35: note: in expansion of macro 'SERIAL_IMPL'

  137 | inline void SERIAL_CHAR(char a) { SERIAL_IMPL.write(a); }

      | ^~~~~~~~~~~

Marlin\src\HAL\STM32\../../inc/../core/serial.h: In function 'void SERIAL_CHAR(char, Args ...)':

Marlin\src\HAL\STM32\../../inc/../core/serial.h:61:26: error: 'MYSERIAL1' was not declared in this scope; did you mean 'MSERIAL'?

   61 | #define _SERIAL_LEAF_1 MYSERIAL1

      | ^~~~~~~~~

Marlin\src\HAL\STM32\../../inc/../core/serial.h:70:25: note: in expansion of macro '_SERIAL_LEAF_1'

   70 | #define SERIAL_LEAF_1 _SERIAL_LEAF_1

      | ^~~~~~~~~~~~~~

Marlin\src\HAL\STM32\../../inc/../core/serial.h:125:31: note: in expansion of macro 'SERIAL_LEAF_1'

  125 | #define SERIAL_IMPL SERIAL_LEAF_1

      | ^~~~~~~~~~~~~

Marlin\src\HAL\STM32\../../inc/../core/serial.h:139:43: note: in expansion of macro 'SERIAL_IMPL'

  139 | void SERIAL_CHAR(char a, Args ... args) { SERIAL_IMPL.write(a); SERIAL_CHAR(args ...); }

      | ^~~~~~~~~~~

In file included from Marlin\src\HAL\STM32\../../inc/MarlinConfig.h:55,

                 from Marlin\src\HAL\STM32\HAL_SPI.cpp:27:

Marlin\src\HAL\STM32\../../inc/../core/serial.h: In function 'void SERIAL_CHAR(char)':

Marlin\src\HAL\STM32\../../inc/../core/serial.h:61:26: error: 'MYSERIAL1' was not declared in this scope; did you mean 'MSERIAL'?

   61 | #define _SERIAL_LEAF_1 MYSERIAL1

      | ^~~~~~~~~

Marlin\src\HAL\STM32\../../inc/../core/serial.h:70:25: note: in expansion of macro '_SERIAL_LEAF_1'

   70 | #define SERIAL_LEAF_1 _SERIAL_LEAF_1

      | ^~~~~~~~~~~~~~

Marlin\src\HAL\STM32\../../inc/../core/serial.h:125:31: note: in expansion of macro 'SERIAL_LEAF_1'

  125 | #define SERIAL_IMPL SERIAL_LEAF_1

      | ^~~~~~~~~~~~~

Marlin\src\HAL\STM32\../../inc/../core/serial.h:137:35: note: in expansion of macro 'SERIAL_IMPL'

  137 | inline void SERIAL_CHAR(char a) { SERIAL_IMPL.write(a); }

      | ^~~~~~~~~~~

*** [.pio\build\STM32F103RE_creality\src\src\HAL\STM32\MarlinSPI.cpp.o] Error 1

Marlin\src\HAL\STM32\../../inc/../core/serial.h: In function 'void SERIAL_CHAR(char, Args ...)':

Marlin\src\HAL\STM32\../../inc/../core/serial.h:61:26: error: 'MYSERIAL1' was not declared in this scope; did you mean 'MSERIAL'?

   61 | #define _SERIAL_LEAF_1 MYSERIAL1

      | ^~~~~~~~~

Marlin\src\HAL\STM32\../../inc/../core/serial.h:70:25: note: in expansion of macro '_SERIAL_LEAF_1'

   70 | #define SERIAL_LEAF_1 _SERIAL_LEAF_1

      | ^~~~~~~~~~~~~~

Marlin\src\HAL\STM32\../../inc/../core/serial.h:125:31: note: in expansion of macro 'SERIAL_LEAF_1'

  125 | #define SERIAL_IMPL SERIAL_LEAF_1

      | ^~~~~~~~~~~~~

Marlin\src\HAL\STM32\../../inc/../core/serial.h:139:43: note: in expansion of macro 'SERIAL_IMPL'

  139 | void SERIAL_CHAR(char a, Args ... args) { SERIAL_IMPL.write(a); SERIAL_CHAR(args ...); }

      | ^~~~~~~~~~~

compilation terminated due to -fmax-errors=5.

In file included from Marlin\src\HAL\STM32\../../inc/MarlinConfig.h:50,

                 from Marlin\src\HAL\STM32\Servo.cpp:27:

Marlin\src\HAL\STM32\../../inc/../HAL/STM32/inc/SanityCheck.h:72:6: error: #error "Serial Port 2 TX IO pins conflict with another pin on the board."

   72 | #error "Serial Port 2 TX IO pins conflict with another pin on the board."

      | ^~~~~

In file included from Marlin\src\HAL\STM32\../../inc/MarlinConfig.h:50,

                 from Marlin\src\HAL\STM32\eeprom_bl24cxx.cpp:32:

Marlin\src\HAL\STM32\../../inc/../HAL/STM32/inc/SanityCheck.h:72:6: error: #error "Serial Port 2 TX IO pins conflict with another pin on the board."

   72 | #error "Serial Port 2 TX IO pins conflict with another pin on the board."

      | ^~~~~

compilation terminated due to -fmax-errors=5.

In file included from Marlin\src\HAL\STM32\../../inc/MarlinConfig.h:49,

                 from Marlin\src\HAL\STM32\eeprom_flash.cpp:27:

Marlin\src\HAL\STM32\../../inc/SanityCheck.h:2268:6: error: #error "FAN_SOFT_PWM is required for your board. Enable it to continue."

 2268 | #error "FAN_SOFT_PWM is required for your board. Enable it to continue."

      | ^~~~~

*** [.pio\build\STM32F103RE_creality\src\src\HAL\STM32\HAL.cpp.o] Error 1

*** [.pio\build\STM32F103RE_creality\src\src\HAL\STM32\HAL_SPI.cpp.o] Error 1

In file included from Marlin\src\HAL\STM32\../../inc/MarlinConfig.h:50,

                 from Marlin\src\HAL\STM32\eeprom_flash.cpp:27:

Marlin\src\HAL\STM32\../../inc/../HAL/STM32/inc/SanityCheck.h:72:6: error: #error "Serial Port 2 TX IO pins conflict with another pin on the board."

   72 | #error "Serial Port 2 TX IO pins conflict with another pin on the board."

      | ^~~~~

In file included from Marlin\src\HAL\STM32\../../inc/../HAL/HAL.h:30,

                 from Marlin\src\HAL\STM32\../../inc/MarlinConfig.h:31,

                 from Marlin\src\HAL\STM32\eeprom_if_iic.cpp:32:

Marlin\src\HAL\STM32\../../inc/../HAL/./STM32/HAL.h:62:4: error: #error "SERIAL_PORT must be from 1 to 6."

   62 | #error "SERIAL_PORT must be from 1 to 6."

      | ^~~~~

In file included from Marlin\src\HAL\STM32\../../inc/../pins/pins.h:926,

                 from Marlin\src\HAL\STM32\../../inc/MarlinConfig.h:34,

                 from Marlin\src\HAL\STM32\eeprom_if_iic.cpp:32:

Marlin\src\HAL\STM32\../../inc/../pins/pins_postprocess.h:500: warning: "X_MAX_PIN" redefined

  500 | #define X_MAX_PIN X_STOP_PIN

      |

In file included from Marlin\src\HAL\STM32\../../inc/MarlinConfigPre.h:39,

                 from Marlin\src\HAL\STM32\../../inc/MarlinConfig.h:28,

                 from Marlin\src\HAL\STM32\eeprom_if_iic.cpp:32:

Marlin\src\HAL\STM32\../../inc/../../Configuration.h:95: note: this is the location of the previous definition

   95 | #define X_MAX_PIN 3 // Creality connects X_MAX to X_MIN(_PIN) motherboard connector

      |

In file included from Marlin\src\HAL\STM32\../../inc/../pins/pins.h:926,

                 from Marlin\src\HAL\STM32\../../inc/MarlinConfig.h:34,

                 from Marlin\src\HAL\STM32\eeprom_if_iic.cpp:32:

Marlin\src\HAL\STM32\../../inc/../pins/pins_postprocess.h:522: warning: "Y_MAX_PIN" redefined

  522 | #define Y_MAX_PIN Y_STOP_PIN

      |

In file included from Marlin\src\HAL\STM32\../../inc/MarlinConfigPre.h:39,

                 from Marlin\src\HAL\STM32\../../inc/MarlinConfig.h:28,

                 from Marlin\src\HAL\STM32\eeprom_if_iic.cpp:32:

Marlin\src\HAL\STM32\../../inc/../../Configuration.h:96: note: this is the location of the previous definition

   96 | #define Y_MAX_PIN 14 // Creality connects Y_MAX to Y_MIN(_PIN) motherboard connector

      |

In file included from Marlin\src\HAL\STM32\../../inc/MarlinConfig.h:49,

                 from Marlin\src\HAL\STM32\eeprom_if_iic.cpp:32:

Marlin\src\HAL\STM32\../../inc/SanityCheck.h:2268:6: error: #error "FAN_SOFT_PWM is required for your board. Enable it to continue."

 2268 | #error "FAN_SOFT_PWM is required for your board. Enable it to continue."

      | ^~~~~

In file included from Marlin\src\HAL\STM32\../../inc/MarlinConfig.h:55,

                 from Marlin\src\HAL\STM32\MarlinSerial.cpp:27:

Marlin\src\HAL\STM32\../../inc/../core/serial.h: In function 'void SERIAL_CHAR(char)':

Marlin\src\HAL\STM32\../../inc/../core/serial.h:61:26: error: 'MYSERIAL1' was not declared in this scope; did you mean 'MSERIAL'?

   61 | #define _SERIAL_LEAF_1 MYSERIAL1

      | ^~~~~~~~~

Marlin\src\HAL\STM32\../../inc/../core/serial.h:70:25: note: in expansion of macro '_SERIAL_LEAF_1'

   70 | #define SERIAL_LEAF_1 _SERIAL_LEAF_1

      | ^~~~~~~~~~~~~~

Marlin\src\HAL\STM32\../../inc/../core/serial.h:125:31: note: in expansion of macro 'SERIAL_LEAF_1'

  125 | #define SERIAL_IMPL SERIAL_LEAF_1

      | ^~~~~~~~~~~~~

Marlin\src\HAL\STM32\../../inc/../core/serial.h:137:35: note: in expansion of macro 'SERIAL_IMPL'

  137 | inline void SERIAL_CHAR(char a) { SERIAL_IMPL.write(a); }

      | ^~~~~~~~~~~

In file included from Marlin\src\HAL\STM32\../../inc/MarlinConfig.h:50,

                 from Marlin\src\HAL\STM32\eeprom_if_iic.cpp:32:

Marlin\src\HAL\STM32\../../inc/../HAL/STM32/inc/SanityCheck.h:72:6: error: #error "Serial Port 2 TX IO pins conflict with another pin on the board."

   72 | #error "Serial Port 2 TX IO pins conflict with another pin on the board."

      | ^~~~~

Marlin\src\HAL\STM32\../../inc/../core/serial.h: In function 'void SERIAL_CHAR(char, Args ...)':

Marlin\src\HAL\STM32\../../inc/../core/serial.h:61:26: error: 'MYSERIAL1' was not declared in this scope; did you mean 'MSERIAL'?

   61 | #define _SERIAL_LEAF_1 MYSERIAL1

      | ^~~~~~~~~

Marlin\src\HAL\STM32\../../inc/../core/serial.h:70:25: note: in expansion of macro '_SERIAL_LEAF_1'

   70 | #define SERIAL_LEAF_1 _SERIAL_LEAF_1

      | ^~~~~~~~~~~~~~

Marlin\src\HAL\STM32\../../inc/../core/serial.h:125:31: note: in expansion of macro 'SERIAL_LEAF_1'

  125 | #define SERIAL_IMPL SERIAL_LEAF_1

      | ^~~~~~~~~~~~~

Marlin\src\HAL\STM32\../../inc/../core/serial.h:139:43: note: in expansion of macro 'SERIAL_IMPL'

  139 | void SERIAL_CHAR(char a, Args ... args) { SERIAL_IMPL.write(a); SERIAL_CHAR(args ...); }

      | ^~~~~~~~~~~

In file included from Marlin\src\HAL\STM32\../../inc/MarlinConfig.h:55,

                 from Marlin\src\HAL\STM32\eeprom_bl24cxx.cpp:32:

Marlin\src\HAL\STM32\../../inc/../core/serial.h: In function 'void SERIAL_CHAR(char)':

Marlin\src\HAL\STM32\../../inc/../core/serial.h:61:26: error: 'MYSERIAL1' was not declared in this scope; did you mean 'MSERIAL'?

   61 | #define _SERIAL_LEAF_1 MYSERIAL1

      | ^~~~~~~~~

Marlin\src\HAL\STM32\../../inc/../core/serial.h:70:25: note: in expansion of macro '_SERIAL_LEAF_1'

   70 | #define SERIAL_LEAF_1 _SERIAL_LEAF_1

      | ^~~~~~~~~~~~~~

Marlin\src\HAL\STM32\../../inc/../core/serial.h:125:31: note: in expansion of macro 'SERIAL_LEAF_1'

  125 | #define SERIAL_IMPL SERIAL_LEAF_1

      | ^~~~~~~~~~~~~

Marlin\src\HAL\STM32\../../inc/../core/serial.h:137:35: note: in expansion of macro 'SERIAL_IMPL'

  137 | inline void SERIAL_CHAR(char a) { SERIAL_IMPL.write(a); }

      | ^~~~~~~~~~~

Marlin\src\HAL\STM32\../../inc/../core/serial.h: In function 'void SERIAL_CHAR(char, Args ...)':

Marlin\src\HAL\STM32\../../inc/../core/serial.h:61:26: error: 'MYSERIAL1' was not declared in this scope; did you mean 'MSERIAL'?

   61 | #define _SERIAL_LEAF_1 MYSERIAL1

      | ^~~~~~~~~

Marlin\src\HAL\STM32\../../inc/../core/serial.h:70:25: note: in expansion of macro '_SERIAL_LEAF_1'

   70 | #define SERIAL_LEAF_1 _SERIAL_LEAF_1

      | ^~~~~~~~~~~~~~

Marlin\src\HAL\STM32\../../inc/../core/serial.h:125:31: note: in expansion of macro 'SERIAL_LEAF_1'

  125 | #define SERIAL_IMPL SERIAL_LEAF_1

      | ^~~~~~~~~~~~~

Marlin\src\HAL\STM32\../../inc/../core/serial.h:139:43: note: in expansion of macro 'SERIAL_IMPL'

  139 | void SERIAL_CHAR(char a, Args ... args) { SERIAL_IMPL.write(a); SERIAL_CHAR(args ...); }

      | ^~~~~~~~~~~

compilation terminated due to -fmax-errors=5.

compilation terminated due to -fmax-errors=5.

In file included from Marlin\src\HAL\STM32\../../inc/MarlinConfig.h:55,

                 from Marlin\src\HAL\STM32\Servo.cpp:27:

Marlin\src\HAL\STM32\../../inc/../core/serial.h: In function 'void SERIAL_CHAR(char)':

Marlin\src\HAL\STM32\../../inc/../core/serial.h:61:26: error: 'MYSERIAL1' was not declared in this scope; did you mean 'MSERIAL'?

   61 | #define _SERIAL_LEAF_1 MYSERIAL1

      | ^~~~~~~~~

Marlin\src\HAL\STM32\../../inc/../core/serial.h:70:25: note: in expansion of macro '_SERIAL_LEAF_1'

   70 | #define SERIAL_LEAF_1 _SERIAL_LEAF_1

      | ^~~~~~~~~~~~~~

Marlin\src\HAL\STM32\../../inc/../core/serial.h:125:31: note: in expansion of macro 'SERIAL_LEAF_1'

  125 | #define SERIAL_IMPL SERIAL_LEAF_1

      | ^~~~~~~~~~~~~

Marlin\src\HAL\STM32\../../inc/../core/serial.h:137:35: note: in expansion of macro 'SERIAL_IMPL'

  137 | inline void SERIAL_CHAR(char a) { SERIAL_IMPL.write(a); }

      | ^~~~~~~~~~~

In file included from Marlin\src\HAL\STM32\../../inc/MarlinConfig.h:55,

                 from Marlin\src\HAL\STM32\eeprom_flash.cpp:27:

Marlin\src\HAL\STM32\../../inc/../core/serial.h: In function 'void SERIAL_CHAR(char)':

Marlin\src\HAL\STM32\../../inc/../core/serial.h:61:26: error: 'MYSERIAL1' was not declared in this scope; did you mean 'MSERIAL'?

   61 | #define _SERIAL_LEAF_1 MYSERIAL1

      | ^~~~~~~~~

Marlin\src\HAL\STM32\../../inc/../core/serial.h:70:25: note: in expansion of macro '_SERIAL_LEAF_1'

   70 | #define SERIAL_LEAF_1 _SERIAL_LEAF_1

      | ^~~~~~~~~~~~~~

Marlin\src\HAL\STM32\../../inc/../core/serial.h:125:31: note: in expansion of macro 'SERIAL_LEAF_1'

  125 | #define SERIAL_IMPL SERIAL_LEAF_1

      | ^~~~~~~~~~~~~

Marlin\src\HAL\STM32\../../inc/../core/serial.h:137:35: note: in expansion of macro 'SERIAL_IMPL'

  137 | inline void SERIAL_CHAR(char a) { SERIAL_IMPL.write(a); }

      | ^~~~~~~~~~~

Marlin\src\HAL\STM32\../../inc/../core/serial.h: In function 'void SERIAL_CHAR(char, Args ...)':

Marlin\src\HAL\STM32\../../inc/../core/serial.h:61:26: error: 'MYSERIAL1' was not declared in this scope; did you mean 'MSERIAL'?

   61 | #define _SERIAL_LEAF_1 MYSERIAL1

      | ^~~~~~~~~

Marlin\src\HAL\STM32\../../inc/../core/serial.h:70:25: note: in expansion of macro '_SERIAL_LEAF_1'

   70 | #define SERIAL_LEAF_1 _SERIAL_LEAF_1

      | ^~~~~~~~~~~~~~

Marlin\src\HAL\STM32\../../inc/../core/serial.h:125:31: note: in expansion of macro 'SERIAL_LEAF_1'

  125 | #define SERIAL_IMPL SERIAL_LEAF_1

      | ^~~~~~~~~~~~~

Marlin\src\HAL\STM32\../../inc/../core/serial.h:139:43: note: in expansion of macro 'SERIAL_IMPL'

  139 | void SERIAL_CHAR(char a, Args ... args) { SERIAL_IMPL.write(a); SERIAL_CHAR(args ...); }

      | ^~~~~~~~~~~

*** [.pio\build\STM32F103RE_creality\src\src\HAL\STM32\MarlinSerial.cpp.o] Error 1

*** [.pio\build\STM32F103RE_creality\src\src\HAL\STM32\eeprom_bl24cxx.cpp.o] Error 1

Marlin\src\HAL\STM32\../../inc/../core/serial.h: In function 'void SERIAL_CHAR(char, Args ...)':

Marlin\src\HAL\STM32\../../inc/../core/serial.h:61:26: error: 'MYSERIAL1' was not declared in this scope; did you mean 'MSERIAL'?

   61 | #define _SERIAL_LEAF_1 MYSERIAL1

      | ^~~~~~~~~

Marlin\src\HAL\STM32\../../inc/../core/serial.h:70:25: note: in expansion of macro '_SERIAL_LEAF_1'

   70 | #define SERIAL_LEAF_1 _SERIAL_LEAF_1

      | ^~~~~~~~~~~~~~

Marlin\src\HAL\STM32\../../inc/../core/serial.h:125:31: note: in expansion of macro 'SERIAL_LEAF_1'

  125 | #define SERIAL_IMPL SERIAL_LEAF_1

      | ^~~~~~~~~~~~~

Marlin\src\HAL\STM32\../../inc/../core/serial.h:139:43: note: in expansion of macro 'SERIAL_IMPL'

  139 | void SERIAL_CHAR(char a, Args ... args) { SERIAL_IMPL.write(a); SERIAL_CHAR(args ...); }

      | ^~~~~~~~~~~

compilation terminated due to -fmax-errors=5.

compilation terminated due to -fmax-errors=5.

*** [.pio\build\STM32F103RE_creality\src\src\HAL\STM32\eeprom_flash.cpp.o] Error 1

*** [.pio\build\STM32F103RE_creality\src\src\HAL\STM32\Servo.cpp.o] Error 1

In file included from Marlin\src\HAL\STM32\../../inc/MarlinConfig.h:55,

                 from Marlin\src\HAL\STM32\eeprom_if_iic.cpp:32:

Marlin\src\HAL\STM32\../../inc/../core/serial.h: In function 'void SERIAL_CHAR(char)':

Marlin\src\HAL\STM32\../../inc/../core/serial.h:61:26: error: 'MYSERIAL1' was not declared in this scope; did you mean 'MSERIAL'?

   61 | #define _SERIAL_LEAF_1 MYSERIAL1

      | ^~~~~~~~~

Marlin\src\HAL\STM32\../../inc/../core/serial.h:70:25: note: in expansion of macro '_SERIAL_LEAF_1'

   70 | #define SERIAL_LEAF_1 _SERIAL_LEAF_1

      | ^~~~~~~~~~~~~~

Marlin\src\HAL\STM32\../../inc/../core/serial.h:125:31: note: in expansion of macro 'SERIAL_LEAF_1'

  125 | #define SERIAL_IMPL SERIAL_LEAF_1

      | ^~~~~~~~~~~~~

Marlin\src\HAL\STM32\../../inc/../core/serial.h:137:35: note: in expansion of macro 'SERIAL_IMPL'

  137 | inline void SERIAL_CHAR(char a) { SERIAL_IMPL.write(a); }

      | ^~~~~~~~~~~

Marlin\src\HAL\STM32\../../inc/../core/serial.h: In function 'void SERIAL_CHAR(char, Args ...)':

Marlin\src\HAL\STM32\../../inc/../core/serial.h:61:26: error: 'MYSERIAL1' was not declared in this scope; did you mean 'MSERIAL'?

   61 | #define _SERIAL_LEAF_1 MYSERIAL1

      | ^~~~~~~~~

Marlin\src\HAL\STM32\../../inc/../core/serial.h:70:25: note: in expansion of macro '_SERIAL_LEAF_1'

   70 | #define SERIAL_LEAF_1 _SERIAL_LEAF_1

      | ^~~~~~~~~~~~~~

Marlin\src\HAL\STM32\../../inc/../core/serial.h:125:31: note: in expansion of macro 'SERIAL_LEAF_1'

  125 | #define SERIAL_IMPL SERIAL_LEAF_1

      | ^~~~~~~~~~~~~

Marlin\src\HAL\STM32\../../inc/../core/serial.h:139:43: note: in expansion of macro 'SERIAL_IMPL'

  139 | void SERIAL_CHAR(char a, Args ... args) { SERIAL_IMPL.write(a); SERIAL_CHAR(args ...); }

      | ^~~~~~~~~~~

compilation terminated due to -fmax-errors=5.

*** [.pio\build\STM32F103RE_creality\src\src\HAL\STM32\eeprom_if_iic.cpp.o] Error 1

====================================================================== [FAILED] Took 57.99 seconds ======================================================================

Ответы на вопросы