KREMEN Реклама
KREMEN Реклама

Ошибки при компиляции SKR mini E3 v.2

epson950
Идет загрузка
Загрузка
30.10.2020
2491
16
Вопросы и ответы

Прошу помощи настройки прошивки для принтера Sovol SV01 с платой SKR mini E3 v.2 + TFT35 v.3

 Sovol SV01 по сути Ender 3 но со столом 250*300 и директ экструдером с Титаном.

Нашел исходники на Гитхабе, пытаюсь компилировать и получаю такие ошибки. Подозреваю, что в самой программе надо выбрать плату, но не могу найти для этой материнки. Или что-то делаю не так :(

Arduino: 1.8.13 (Windows Store 1.8.42.0) (Windows 10), Плата:"Arduino Mega or Mega 2560, ATmega2560 (Mega 2560)"In file included from c:\temp\arduino_build_198403\sketch\src\pins\stm32f1/pins_BTT_SKR_MINI_E3_V2_0.h:33:0,                 from c:\temp\arduino_build_198403\sketch\src\pins\pins.h:547,                 from c:\temp\arduino_build_198403\sketch\src\inc\marlinconfig.h:32,                 from sketch\src\HAL\STM32F1\onboard_sd.cpp:14:c:\temp\arduino_build_198403\sketch\src\pins\stm32f1/pins_BTT_SKR_MINI_E3_common.h:25:4: error: #error "Oops! Select an STM32F1 board in 'Tools > Board.'"   #error "Oops! Select an STM32F1 board in 'Tools > Board.'"    ^~~~~In file included from c:\temp\arduino_build_198403\sketch\src\inc\marlinconfig.h:41:0,                 from sketch\src\HAL\STM32F1\onboard_sd.cpp:14:c:\temp\arduino_build_198403\sketch\src\inc\SanityCheck.h:1627:4: error: #error "You cannot set CONTROLLER_FAN_PIN equal to FAN_PIN."   #error "You cannot set CONTROLLER_FAN_PIN equal to FAN_PIN."    ^~~~~In file included from sketch\src\HAL\STM32F1\onboard_sd.cpp:19:0:sketch\src\HAL\STM32F1\SPI.h:28:10: fatal error: libmaple/libmaple_types.h: No such file or directory #include           ^~~~~~~~~~~~~~~~~~~~~~~~~~~compilation terminated.exit status 1Ошибка компиляции для платы Arduino Mega or Mega 2560.
Ответы на вопросы
Lider 3D Реклама
Lider 3D Реклама